{"text_format":"1","workbook":"xlsx","n_sheets":5,"sheets":["促進計画書（受け手）","3.経営状況（個人）","3.経営状況（農地所有適格法人）","別紙","ボツ"],"not_rendered":{"charts":0,"images":0,"macros":0,"external_links":1,"defined_names":5,"comments":0,"pivot_tables":0},"unopened":[],"bounds":{"document_bytes":16777216,"sheet_cells":100000,"rows_first":2000,"rows_last":500,"rows_between":2000,"halvings":0,"cell_chars":16384,"cell_head_chars":4096},"cells_cut":0,"cells_raw":0,"read":"whole","date_system":"1900"}

{"sheet":"促進計画書（受け手）","index":0,"n_rows":115,"n_cols":17,"rows_kept":115,"cut":false,"hidden":false,"merged":[[76,0,76,16],[75,0,75,16],[114,0,114,16],[113,0,113,16],[112,0,112,16],[111,0,111,16],[110,0,110,16],[109,0,109,16],[108,0,108,16],[107,0,107,16],[106,0,106,16],[105,0,105,16],[104,0,104,16],[85,5,87,8],[85,1,87,4],[88,12,90,15],[88,9,90,11],[88,5,90,8],[88,1,90,4],[97,11,99,15],[97,7,99,10],[97,1,99,6],[94,11,96,15],[94,7,96,10],[70,0,70,16],[69,0,69,16],[68,0,68,16],[67,0,67,16],[66,0,66,16],[65,0,65,16],[64,0,64,16],[103,0,103,16],[102,0,102,16],[101,0,101,16],[84,0,84,16],[92,0,92,16],[74,0,74,16],[73,0,73,16],[72,0,72,16],[71,0,71,16],[82,0,82,16],[81,0,81,16],[80,0,80,16],[79,0,79,16],[78,0,78,16],[77,0,77,16],[85,12,87,15],[85,9,87,11],[63,0,63,16],[62,0,62,16],[61,0,61,16],[60,0,60,16],[59,0,59,16],[58,0,58,16],[57,0,57,16],[56,0,56,16],[55,0,55,16],[54,0,54,16],[53,0,53,16],[52,0,52,16],[50,0,50,16],[51,0,51,16],[49,0,49,16],[48,0,48,16],[47,0,47,16],[46,0,46,16],[36,1,36,15],[25,1,25,15],[28,1,28,15],[29,1,29,15],[31,1,31,15],[32,1,32,15],[33,1,33,15],[21,15,24,15],[22,8,24,8],[22,9,24,9],[22,10,24,10],[22,11,24,11],[22,12,22,13],[23,1,24,1],[23,2,24,2],[23,3,24,3],[20,1,20,2],[21,1,21,6],[94,1,96,6],[21,7,21,14],[10,12,11,15],[22,1,22,4],[22,5,24,5],[22,6,23,6],[22,7,24,7],[13,12,13,15],[44,0,44,16],[45,0,45,16],[43,0,43,16],[42,0,42,16],[41,0,41,16],[40,0,40,16],[39,0,39,16],[23,4,24,4],[16,1,18,1],[16,2,16,5],[16,6,16,8],[23,12,24,12],[34,1,34,15],[35,1,35,15],[16,9,16,11],[17,2,18,5],[17,6,18,8],[17,9,18,11],[10,1,14,1],[10,2,11,2],[10,3,11,5],[10,6,11,7],[10,8,10,10],[12,6,12,7],[12,11,14,11],[13,6,14,7],[10,11,11,11],[11,8,11,10],[12,2,14,5],[12,8,14,10],[5,1,9,1],[5,2,6,2],[5,3,6,5],[5,6,6,7],[5,8,5,10],[5,12,6,15],[6,8,6,10],[7,2,9,5],[7,6,7,7],[7,8,7,10],[7,11,9,11],[7,12,9,15],[8,6,9,7],[8,8,8,10],[9,8,9,10],[5,11,6,11]]}
["（様式6－5）農用地利用集積等促進計画書(埼玉県農林公社→受け手)"]
[]
[null,null,null,null,null,null,"農　用　地　利　用　集　積　等　促　進　計　画　書　（記入例）",null,null,null,null,null,null,"捨印","捨印",null,1]
[null,null,null,null,null,null,null,null,null,null,null,null,null,"㊞","㊞"]
[]
[null,"賃借権又は使用貸借権の設定を行う者（甲）","〒","361-0013",null,null,"電話番号",null,"ﾌﾘｶﾞﾅ",null,null,"同意印","生年月日"]
[null,null,null,null,null,null,null,null,"ｺｳｴｷｼｬﾀﾞﾝﾎｳｼﾞﾝｻｲﾀﾏｹﾝﾉｳﾘﾝｺｳｼｬﾘｼﾞﾁｮｳ"]
[null,null,"埼玉県行田市大字真名板1975番1",null,null,null,"（昼間連絡がつく番号）",null,"（氏名又は名称）",null,null,"㊞"]
[null,null,null,null,null,null,"048-558-3555",null,"公益社団法人埼玉県農林公社"]
[null,null,null,null,null,null,null,null,"理事長   小畑　幹"]
[null,"賃借権又は使用貸借権の設定を受ける者（乙）","〒","350-0292",null,null,"電話番号",null,"ﾌﾘｶﾞﾅ",null,null,"同意印","生年月日"]
[null,null,null,null,null,null,null,null,"ノウギョウ　ジロウ"]
[null,null,"坂戸市千代田１－１－１",null,null,null,"（昼間連絡がつく番号）",null,"農業　次郎\n（法人の場合は法人名及び代表者名）",null,null,"㊞"]
[null,null,null,null,null,null,"〇〇〇－〇〇〇－〇〇〇〇",null,null,null,null,null,"昭和〇〇年〇〇月〇〇日"]
[]
{"$rows_left_out":101}
{"sheet":"3.経営状況（個人）","index":1,"n_rows":14,"n_cols":19,"rows_kept":14,"cut":false,"hidden":false,"merged":[[2,1,5,2],[9,3,9,4],[9,8,9,9],[8,8,8,9],[2,5,2,10],[6,1,6,2],[8,10,11,10],[10,8,11,8],[6,8,7,8],[6,10,6,11],[7,10,7,11],[2,17,2,18],[3,3,5,6],[3,7,5,7],[3,8,4,14],[5,8,5,9],[5,10,5,14],[2,3,2,4],[2,12,2,14],[2,15,2,16],[12,1,12,9],[12,10,13,18],[13,1,13,9],[10,1,10,2],[8,1,8,2],[10,3,11,6],[8,11,9,11],[10,11,11,11]]}
[]
[null,"３．賃借権又は使用貸借権の設定を受ける者（乙）の農業経営の状況等（法人以外）"]
[null,"賃借権又は使用貸借権の設定を受ける土地の面積(A)",null,"氏名",null,"農業　次郎",null,null,null,null,null,"農業従事日数","200 日",null,null,"家畜の飼養状況（Ｅ）",null,"農機具の所有状況（Ｆ）"]
[null,null,null,"現に耕作又は養畜の事業に供している\n農用地の面積(B)",null,null,null,"主たる経営 \n 作目(Ｃ)","世帯員(構成員)の農作業従事及び雇用労働力の状況(D)",null,null,null,null,null,null,"乳牛","頭","耕耘機","台"]
[null,null,null,null,null,null,null,null,null,null,null,null,null,null,null,"肥育牛","頭","トラクター","１　台"]
[null,null,null,null,null,null,null,null,"世帯員(構成員)",null,"農業従事者(うち１５歳以上６０歳未満の者)",null,null,null,null,"豚","頭","もみすり機","台"]
[null,"農地",null,"農地","自作地",100,"㎡","水稲",3,null,"農業専従者",null,null,null,null,"鶏","羽","乾燥機","台"]
[null,"〇〇","㎡",null,"借入地",500,"㎡",null,null,"人","（年150日以上従事）",null,2,"人　（","2　　人）",null,null,"田植機","台"]
[null,"採草放牧地",null,null,"合計",600,"㎡",null,"農業雇用労働力",null,"農業補助者","主として\n農業に従事する者",null,null,null,null,null,"コンバイン","１　台"]
[null,null,"㎡","採草放牧地",null,null,"㎡",null,"（年間延日数）",null,null,null,1,"人　（","0　　人）",null,null,"トラック","１　台"]
[null,"その他",null,null,null,null,null,null,500,null,null,"従として\n農業に従事する者"]
[null,null,"㎡",null,null,null,null,null,null,"延人日",null,null,null,"人　（","人）"]
[null,"権利設定等を受ける者が権利設定等を受けた後に行う耕作又は養畜の事業が、権利設定等",null,null,null,null,null,null,null,null,"なし"]
[null,"を受ける農用地等の周辺の農用地の農業上の利用に及ぼすことが見込まれる影響（Ｇ）"]

{"sheet":"3.経営状況（農地所有適格法人）","index":2,"n_rows":52,"n_cols":86,"rows_kept":52,"cut":false,"hidden":false,"merged":[[2,0,2,8],[2,9,2,19],[2,20,3,67],[3,9,3,19],[1,0,1,9],[1,10,1,13],[1,14,1,27],[1,28,1,70],[3,0,6,8],[6,68,6,78],[4,9,4,19],[4,20,5,67],[5,9,5,19],[2,68,5,78],[2,79,5,89],[1,80,1,89],[1,71,1,77],[1,78,1,79],[7,79,9,84],[6,9,6,19],[6,20,15,20],[6,21,6,35],[6,36,6,51],[6,52,6,67],[9,52,9,67],[10,9,21,12],[6,79,6,89],[12,52,13,67],[13,79,15,84],[8,36,8,51],[8,52,8,67],[16,79,18,84],[16,85,18,89],[18,68,21,73],[18,74,21,78],[19,79,21,84],[19,85,21,89],[20,21,21,35],[7,0,7,8],[7,9,7,19],[7,21,7,35],[7,36,7,51],[7,52,7,67],[7,68,9,73],[13,85,15,89],[14,21,15,35],[14,36,15,51],[14,52,15,67],[10,21,11,35],[10,36,11,51],[10,52,11,67],[10,68,13,73],[10,74,13,78],[14,68,17,73],[7,85,9,89],[8,0,8,8],[8,9,8,19],[8,21,8,35],[10,79,12,84],[10,85,12,89],[12,21,13,35],[12,36,13,51],[9,0,9,8],[9,9,9,19],[9,21,9,35],[9,36,9,51],[30,74,33,78],[22,9,33,12],[22,13,33,19],[10,0,18,2],[10,3,18,8],[14,74,17,78],[26,74,29,78],[20,52,33,67],[22,21,23,35],[22,36,23,51],[16,21,19,67],[7,74,9,78],[20,36,21,51],[10,13,21,19],[16,20,33,20],[22,74,25,78],[19,0,27,2],[19,3,27,8],[28,0,33,2],[28,3,33,8],[36,28,36,37],[36,38,38,46],[36,47,38,55],[22,79,24,84],[22,85,24,89],[24,21,27,35],[24,36,27,51],[25,79,27,84],[25,85,27,89],[38,70,38,74],[38,75,38,79],[38,80,38,84],[38,85,38,89],[28,21,29,35],[28,36,29,51],[28,79,30,84],[28,85,30,89],[30,21,33,35],[30,36,33,51],[30,68,33,73],[26,68,29,73],[22,68,25,73],[31,79,33,84],[41,85,42,89],[39,85,40,89],[39,38,40,46],[39,47,40,55],[39,56,40,69],[41,70,42,74],[41,75,42,79],[41,80,42,84],[31,85,33,89],[34,0,35,46],[34,47,35,89],[36,56,38,69],[36,70,36,89],[37,15,37,27],[37,28,37,37],[37,70,37,79],[37,80,37,89],[38,15,38,21],[38,22,38,27],[38,28,38,32],[38,33,38,37],[36,0,38,8],[36,9,38,14],[36,15,36,27],[39,0,40,8],[39,9,40,14],[39,15,40,21],[39,22,40,27],[39,28,40,32],[39,33,40,37],[39,70,40,74],[39,75,40,79],[39,80,40,84],[41,56,42,69],[47,0,48,8],[47,9,48,14],[47,15,48,21],[47,22,48,27],[47,28,48,32],[47,33,48,37],[41,0,42,8],[41,9,42,14],[41,15,42,21],[41,22,42,27],[41,28,42,32],[41,33,42,37],[41,38,42,46],[41,47,42,55],[43,0,44,8],[43,9,44,14],[43,15,44,21],[43,22,44,27],[43,28,44,32],[43,33,44,37],[43,85,44,89],[43,38,44,46],[43,47,44,55],[45,38,46,46],[45,47,46,55],[45,56,46,69],[47,70,48,74],[47,75,48,79],[47,80,48,84],[43,56,44,69],[43,70,44,74],[43,75,44,79],[43,80,44,84],[50,47,51,89],[45,70,46,74],[45,75,46,79],[45,80,46,84],[45,85,46,89],[51,0,51,46],[47,85,48,89],[49,0,49,14],[49,15,49,25],[49,26,49,28],[49,30,49,89],[50,0,50,46],[47,38,48,46],[47,47,48,55],[47,56,48,69],[45,0,46,8],[45,9,46,14],[45,15,46,21],[45,22,46,27],[45,28,46,32],[45,33,46,37]]}
["３．賃借権又は使用貸借権の設定を受ける者の農業経営の状況等（農地所有適格法人）"]
["整理番号",null,null,null,null,null,null,null,null,null,null,null,null,null,"法人の名称",null,null,null,null,null,null,null,null,null,null,null,null,null,"坂戸農業　株式会社"]
[null,null,null,null,null,null,null,null,null,null,null,null,null,null,null,null,null,null,null,null,"賃借権又は使用貸借権の設定を受ける法人の事業の状況（Ｃ）",null,null,null,null,null,null,null,null,null,null,null,null,null,null,null,null,null,null,null,null,null,null,null,null,null,null,null,null,null,null,null,null,null,null,null,null,null,null,null,null,null,null,null,null,null,null,null,"賃借権又は使用貸借権の設定を受ける法人の主な家畜の飼養の状況（Ｆ）",null,null,null,null,null,null,null,null,null,null,"賃借権又は使用貸借権の設定を受ける法人の主な農機具の所有の状況（Ｇ）"]
["賃借権又は使用貸借権の設定を受ける土地の面積（Ａ）",null,null,null,null,null,null,null,null,"賃借権又は使用貸借権"]
[null,null,null,null,null,null,null,null,null,"の設定を受ける法人",null,null,null,null,null,null,null,null,null,null,"　　　　　　事　　業　　の　　種　　類"]
[null,null,null,null,null,null,null,null,null,"が耕作又は養畜の"]
[null,null,null,null,null,null,null,null,null,"事業に供している農用",null,null,null,null,null,null,null,null,null,null,null,"農畜産物名",null,null,null,null,null,null,null,null,null,null,null,null,null,null,"関連事業等の内容",null,null,null,null,null,null,null,null,null,null,null,null,null,null,null,"左記以外の事業の内容"]
["　　　㎡",null,null,null,null,null,null,null,null,"地の面積 （Ｂ）",null,null,null,null,null,null,null,null,null,null,null,"　現在",null,null,null,null,null,null,null,null,null,null,null,null,null,null,"　現在",null,null,null,null,null,null,null,null,null,null,null,null,null,null,null,"　現在",null,null,null,null,null,null,null,null,null,null,null,null,null,null,null,"種類",null,null,null,null,null,"数量",null,null,null,null,"種類",null,null,null,null,null,"数量"]
[null,null,null,null,null,null,null,null,null,"㎡",null,null,null,null,null,null,null,null,null,null,null,"水稲"]
[]
["農地",null,null,"〇㎡",null,null,null,null,null,"農　地",null,null,null,null,null,null,null,null,null,null,null,"　権利取得後",null,null,null,null,null,null,null,null,null,null,null,null,null,null,"　権利取得後",null,null,null,null,null,null,null,null,null,null,null,null,null,null,null,"　権利取得後",null,null,null,null,null,null,null,null,null,null,null,null,null,null,null,"乳牛",null,null,null,null,null,null,null,null,null,null,"耕耘機",null,null,null,null,null,1]
[]
[]
[null,null,null,null,null,null,null,null,null,null,null,null,null,null,null,null,null,null,null,null,null,null,null,null,null,null,null,null,null,null,null,null,null,null,null,null,null,null,null,null,null,null,null,null,null,null,null,null,null,null,null,null,null,null,null,null,null,null,null,null,null,null,null,null,null,null,null,null,null,null,null,null,null,null,null,null,null,null,null,"トラクター"]
[null,null,null,null,null,null,null,null,null,null,null,null,null,null,null,null,null,null,null,null,null,null,null,null,null,null,null,null,null,null,null,null,null,null,null,null,null,null,null,null,null,null,null,null,null,null,null,null,null,null,null,null,null,null,null,null,null,null,null,null,null,null,null,null,null,null,null,null,"肥育牛"]
{"$rows_left_out":38}
{"sheet":"別紙","index":3,"n_rows":122,"n_cols":16,"rows_kept":122,"cut":false,"hidden":false,"merged":[[0,1,0,2],[0,14,0,15],[1,1,1,6],[1,7,1,14],[1,15,4,15],[2,1,2,4],[2,5,4,5],[2,6,3,6],[2,7,4,7],[2,8,4,8],[2,9,4,9],[2,10,4,10],[2,11,4,11],[2,12,2,13],[3,1,4,1],[3,2,4,2],[3,3,4,3],[3,4,4,4],[3,12,4,12]]}
[null,"別紙（記入例）"]
[null,"賃借権又は使用貸借権の設定を行う土地（B）",null,null,null,null,null,"（乙）に設定する権利（C）",null,null,null,null,null,null,null,"備　考"]
[null,"所　　　　在",null,null,null,"現況\n地目","面積","権　利\nの種類","内容\n(利用目的・\n作付作物等)","始期\n（年月日）","終期\n（年月日）","存続期間\n（年月）","借賃",null,"借賃の"]
[null,"市町村","大字 ","字","地　　番",null,null,null,null,null,null,null,"年額\n（円）","10aあたり","支払方法"]
[null,null,null,null,null,null,"（㎡）",null,null,null,null,null,null,"（円）","（支払期限）"]
[1,"坂戸市","〇〇","〇〇","〇〇－〇","田","〇〇〇","使用貸借","水田利用","令和7年6月1日","令和〇年5月31日","〇年","0円","0円"]
[2,"坂戸市","〇〇","〇〇","〇〇－〇","畑","〇〇〇","賃貸借","普通畑利用","令和7年6月1日","令和〇年5月31日","〇年","〇〇円","〇〇円","口座\n（12月末日）"]
[3,"坂戸市","〇〇","〇〇","〇〇－〇","田","〇〇〇","賃貸借","水田利用","令和7年6月1日","令和〇年5月31日","〇年","〇〇円","〇〇円","口座\n（12月末日）"]
[4,{"$f":"IF(C9=\"\",\"\",\"坂戸市\")","v":""},{"$f":"IFERROR(VLOOKUP('[1]促進計画書（出し手用）A４'!$T$6&\"-\"&A9,[1]利用権終期一覧!C5:R166,2,FALSE),\"\")","v":""},{"$f":"IFERROR(VLOOKUP('[1]促進計画書（出し手用）A４'!$T$6&\"-\"&A9,[1]利用権終期一覧!C5:R166,3,FALSE),\"\")","v":""},{"$f":"IFERROR(VLOOKUP('[1]促進計画書（出し手用）A４'!$T$6&\"-\"&A9,[1]利用権終期一覧!C5:R166,6,FALSE),\"\")","v":""},{"$f":"IFERROR(VLOOKUP('[1]促進計画書（出し手用）A４'!$T$6&\"-\"&A9,[1]利用権終期一覧!C5:R166,8,FALSE),\"\")","v":""},{"$f":"IFERROR(VLOOKUP('[1]促進計画書（出し手用）A４'!$T$6&\"-\"&A9,[1]利用権終期一覧!C5:R166,9,FALSE),\"\")","v":""},null,{"$f":"IF(F9=\"田\",\"水田利用\",IF(F9=\"畑\",\"普通畑利用\",\"\"))","v":""},{"$f":"IF(I9=\"\",\"\",\"令和7年6月1日\")","v":""}]
[5,"",{"$f":"IFERROR(VLOOKUP('[1]促進計画書（出し手用）A４'!$T$6&\"-\"&A10,[1]利用権終期一覧!C6:R167,2,FALSE),\"\")","v":""},{"$f":"IFERROR(VLOOKUP('[1]促進計画書（出し手用）A４'!$T$6&\"-\"&A10,[1]利用権終期一覧!C6:R167,3,FALSE),\"\")","v":""},{"$f":"IFERROR(VLOOKUP('[1]促進計画書（出し手用）A４'!$T$6&\"-\"&A10,[1]利用権終期一覧!C6:R167,6,FALSE),\"\")","v":""},{"$f":"IFERROR(VLOOKUP('[1]促進計画書（出し手用）A４'!$T$6&\"-\"&A10,[1]利用権終期一覧!C6:R167,8,FALSE),\"\")","v":""},{"$f":"IFERROR(VLOOKUP('[1]促進計画書（出し手用）A４'!$T$6&\"-\"&A10,[1]利用権終期一覧!C6:R167,9,FALSE),\"\")","v":""},null,"",""]
[6,"",{"$f":"IFERROR(VLOOKUP('[1]促進計画書（出し手用）A４'!$T$6&\"-\"&A11,[1]利用権終期一覧!C7:R168,2,FALSE),\"\")","v":""},{"$f":"IFERROR(VLOOKUP('[1]促進計画書（出し手用）A４'!$T$6&\"-\"&A11,[1]利用権終期一覧!C7:R168,3,FALSE),\"\")","v":""},{"$f":"IFERROR(VLOOKUP('[1]促進計画書（出し手用）A４'!$T$6&\"-\"&A11,[1]利用権終期一覧!C7:R168,6,FALSE),\"\")","v":""},{"$f":"IFERROR(VLOOKUP('[1]促進計画書（出し手用）A４'!$T$6&\"-\"&A11,[1]利用権終期一覧!C7:R168,8,FALSE),\"\")","v":""},{"$f":"IFERROR(VLOOKUP('[1]促進計画書（出し手用）A４'!$T$6&\"-\"&A11,[1]利用権終期一覧!C7:R168,9,FALSE),\"\")","v":""},null,"",""]
[7,"",{"$f":"IFERROR(VLOOKUP('[1]促進計画書（出し手用）A４'!$T$6&\"-\"&A12,[1]利用権終期一覧!C8:R169,2,FALSE),\"\")","v":""},{"$f":"IFERROR(VLOOKUP('[1]促進計画書（出し手用）A４'!$T$6&\"-\"&A12,[1]利用権終期一覧!C8:R169,3,FALSE),\"\")","v":""},{"$f":"IFERROR(VLOOKUP('[1]促進計画書（出し手用）A４'!$T$6&\"-\"&A12,[1]利用権終期一覧!C8:R169,6,FALSE),\"\")","v":""},{"$f":"IFERROR(VLOOKUP('[1]促進計画書（出し手用）A４'!$T$6&\"-\"&A12,[1]利用権終期一覧!C8:R169,8,FALSE),\"\")","v":""},{"$f":"IFERROR(VLOOKUP('[1]促進計画書（出し手用）A４'!$T$6&\"-\"&A12,[1]利用権終期一覧!C8:R169,9,FALSE),\"\")","v":""},null,"",""]
[8,"",{"$f":"IFERROR(VLOOKUP('[1]促進計画書（出し手用）A４'!$T$6&\"-\"&A13,[1]利用権終期一覧!C9:R170,2,FALSE),\"\")","v":""},{"$f":"IFERROR(VLOOKUP('[1]促進計画書（出し手用）A４'!$T$6&\"-\"&A13,[1]利用権終期一覧!C9:R170,3,FALSE),\"\")","v":""},{"$f":"IFERROR(VLOOKUP('[1]促進計画書（出し手用）A４'!$T$6&\"-\"&A13,[1]利用権終期一覧!C9:R170,6,FALSE),\"\")","v":""},{"$f":"IFERROR(VLOOKUP('[1]促進計画書（出し手用）A４'!$T$6&\"-\"&A13,[1]利用権終期一覧!C9:R170,8,FALSE),\"\")","v":""},{"$f":"IFERROR(VLOOKUP('[1]促進計画書（出し手用）A４'!$T$6&\"-\"&A13,[1]利用権終期一覧!C9:R170,9,FALSE),\"\")","v":""},null,"",""]
[9,"",{"$f":"IFERROR(VLOOKUP('[1]促進計画書（出し手用）A４'!$T$6&\"-\"&A14,[1]利用権終期一覧!C10:R171,2,FALSE),\"\")","v":""},{"$f":"IFERROR(VLOOKUP('[1]促進計画書（出し手用）A４'!$T$6&\"-\"&A14,[1]利用権終期一覧!C10:R171,3,FALSE),\"\")","v":""},{"$f":"IFERROR(VLOOKUP('[1]促進計画書（出し手用）A４'!$T$6&\"-\"&A14,[1]利用権終期一覧!C10:R171,6,FALSE),\"\")","v":""},{"$f":"IFERROR(VLOOKUP('[1]促進計画書（出し手用）A４'!$T$6&\"-\"&A14,[1]利用権終期一覧!C10:R171,8,FALSE),\"\")","v":""},{"$f":"IFERROR(VLOOKUP('[1]促進計画書（出し手用）A４'!$T$6&\"-\"&A14,[1]利用権終期一覧!C10:R171,9,FALSE),\"\")","v":""},null,"",""]
[10,{"$f":"IFERROR(VLOOKUP('促進計画書（受け手）'!#REF!&\"-\"&A15,#REF!,2,FALSE),\"\")","v":""},{"$f":"IFERROR(VLOOKUP('促進計画書（受け手）'!#REF!&\"-\"&A15,#REF!,3,FALSE),\"\")","v":""},{"$f":"IFERROR(VLOOKUP('促進計画書（受け手）'!#REF!&\"-\"&A15,#REF!,4,FALSE),\"\")","v":""},{"$f":"IFERROR(VLOOKUP('促進計画書（受け手）'!#REF!&\"-\"&A15,#REF!,10,FALSE),\"\")","v":""},{"$f":"IFERROR(VLOOKUP('促進計画書（受け手）'!#REF!&\"-\"&A15,#REF!,12,FALSE),\"\")","v":""},{"$f":"IFERROR(VLOOKUP('促進計画書（受け手）'!#REF!&\"-\"&A15,#REF!,13,FALSE),\"\")","v":""},null,{"$f":"IF(F15=\"田\",\"水田利用\",IF(F15=\"畑\",\"普通畑利用\",\"\"))","v":""},{"$f":"IF(I15=\"\",\"\",\"令和7年6月1日\")","v":""}]
{"$rows_left_out":108}
{"sheet":"ボツ","index":4,"n_rows":202,"n_cols":29,"rows_kept":202,"cut":false,"hidden":true,"merged":[[59,1,59,3],[59,4,61,4],[59,15,59,17],[60,1,60,2],[60,15,60,17],[61,1,61,3],[61,12,61,14],[61,15,64,15],[61,16,62,17],[62,1,62,2],[62,4,62,5],[62,12,62,14],[63,1,63,3],[63,16,64,17],[64,1,64,2],[55,1,58,3],[55,4,55,6],[55,16,55,17],[55,18,55,20],[55,21,55,22],[55,23,55,25],[55,26,55,28],[56,4,58,9],[56,12,57,22],[58,12,58,14],[58,15,58,22],[56,10,58,11],[10,18,12,21],[10,3,12,7],[15,3,18,7],[48,2,49,4],[16,18,16,19],[13,12,13,13],[14,12,18,13],[48,14,49,14],[48,15,49,16],[48,17,49,18],[48,19,49,19],[44,12,45,12],[44,13,45,13],[44,14,45,14],[44,15,45,16],[48,20,49,20],[48,21,49,23],[25,17,25,18],[25,21,27,23],[13,2,18,2],[8,15,12,17],[13,15,18,17],[8,12,8,13],[44,21,45,23],[48,24,49,25],[46,20,47,20],[46,21,47,23],[46,24,47,25],[8,8,8,11],[9,8,9,11],[10,8,10,11],[11,8,12,11],[13,8,13,11],[14,8,14,11],[15,8,15,11],[16,8,17,11],[18,8,18,11],[36,19,37,19],[36,20,37,20],[36,21,37,23],[36,24,37,25],[32,14,33,14],[32,15,33,16],[32,17,33,18],[32,19,33,19],[32,20,33,20],[32,21,33,23],[32,24,33,25],[8,1,12,1],[8,2,12,2],[48,26,49,26],[48,27,49,27],[48,28,49,28],[2,22,2,23],[2,24,2,27],[3,22,4,23],[3,24,4,27],[5,22,5,27],[6,22,6,27],[8,22,8,27],[9,22,9,27],[10,22,10,25],[11,22,12,27],[14,28,18,28],[13,22,13,27],[14,22,14,27],[15,22,15,27],[16,22,17,27],[18,22,18,27],[48,12,49,12],[48,13,49,13],[46,26,47,26],[48,0,49,0],[48,1,49,1],[48,5,49,7],[48,8,49,8],[48,9,49,9],[48,11,49,11],[44,26,45,26],[44,27,45,27],[44,28,45,28],[46,0,47,0],[46,1,47,1],[46,2,47,2],[46,3,47,3],[46,4,47,4],[46,5,47,7],[46,8,47,8],[46,9,47,9],[46,11,47,11],[46,12,47,12],[46,13,47,13],[46,14,47,14],[46,15,47,16],[46,17,47,18],[46,19,47,19],[44,24,45,25],[44,0,45,0],[44,1,45,1],[44,2,45,2],[44,3,45,3],[44,4,45,4],[44,5,45,7],[44,8,45,8],[44,9,45,9],[44,11,45,11],[36,26,37,26],[36,27,37,27],[36,28,37,28],[38,0,39,0],[38,1,39,1],[38,2,39,2],[38,3,39,3],[38,4,39,4],[38,5,39,7],[38,8,39,8],[38,9,39,9],[38,11,39,11],[38,12,39,12],[38,13,39,13],[38,14,39,14],[38,15,39,16],[38,17,39,18],[38,19,39,19],[38,20,39,20],[38,21,39,23],[36,17,37,18],[36,8,37,8],[36,9,37,9],[36,11,37,11],[32,28,33,28],[34,0,35,0],[34,1,35,1],[34,2,35,2],[34,3,35,3],[34,4,35,4],[34,5,35,7],[34,8,35,8],[34,9,35,9],[34,11,35,11],[34,12,35,12],[34,13,35,13],[34,14,35,14],[34,15,35,16],[34,17,35,18],[34,19,35,19],[34,20,35,20],[34,21,35,23],[34,24,35,25],[34,26,35,26],[34,27,35,27],[34,28,35,28],[32,0,33,0],[32,1,33,1],[32,26,33,26],[32,27,33,27],[32,2,33,2],[32,3,33,3],[32,4,33,4],[32,5,33,7],[32,8,33,8],[32,9,33,9],[32,11,33,11],[32,12,33,12],[32,13,33,13],[30,17,31,18],[30,19,31,19],[30,20,31,20],[30,21,31,23],[30,24,31,25],[30,26,31,26],[30,27,31,27],[30,28,31,28],[28,26,29,26],[28,27,29,27],[30,0,31,0],[30,1,31,1],[30,2,31,2],[30,3,31,3],[30,4,31,4],[30,5,31,7],[30,8,31,8],[30,9,31,9],[30,11,31,11],[27,24,27,25],[28,14,29,14],[28,15,29,16],[28,17,29,18],[28,19,29,19],[28,20,29,20],[28,21,29,23],[28,24,29,25],[28,28,29,28],[9,12,12,13],[24,28,27,28],[25,0,27,0],[26,5,27,7],[26,8,27,8],[26,17,26,18],[26,24,26,25],[26,9,27,9],[27,17,27,18],[24,1,24,10],[24,11,24,19],[24,20,27,20],[24,21,24,27],[25,1,27,1],[25,2,25,7],[25,8,25,9],[25,10,26,10],[25,11,27,11],[25,12,27,12],[25,15,27,16],[25,24,25,25],[25,27,27,27],[26,2,27,2],[26,3,27,3],[42,0,43,0],[42,1,43,1],[42,2,43,2],[42,3,43,3],[42,4,43,4],[191,18,191,19],[42,19,43,19],[28,0,29,0],[28,1,29,1],[28,2,29,2],[28,3,29,3],[28,4,29,4],[36,2,37,2],[36,3,37,3],[36,4,37,4],[36,5,37,7],[36,0,37,0],[36,1,37,1],[28,5,29,7],[28,8,29,8],[28,9,29,9],[28,11,29,11],[28,12,29,12],[28,13,29,13],[40,0,41,0],[40,1,41,1],[40,2,41,2],[40,3,41,3],[40,4,41,4],[40,5,41,7],[40,8,41,8],[40,9,41,9],[40,11,41,11],[38,26,39,26],[38,27,39,27],[38,28,39,28],[40,12,41,12],[40,13,41,13],[40,14,41,14],[40,15,41,16],[40,17,41,18],[40,19,41,19],[38,24,39,25],[40,20,41,20],[40,21,41,23],[40,24,41,25],[40,26,41,26],[40,27,41,27],[40,28,41,28],[42,24,43,25],[42,26,43,26],[42,27,43,27],[42,28,43,28],[197,1,197,4],[197,5,197,11],[197,12,197,17],[191,1,191,4],[191,5,191,11],[191,12,191,17],[42,5,43,7],[42,8,43,8],[42,9,43,9],[42,11,43,11],[42,12,43,12],[42,13,43,13],[42,14,43,14],[42,15,43,16],[42,17,43,18],[44,17,45,18],[44,19,45,19],[44,20,45,20],[46,27,47,27],[46,28,47,28],[20,8,20,11],[20,1,22,2],[20,3,20,7],[201,1,202,13],[192,1,192,4],[192,5,192,11],[192,12,192,17],[192,18,192,19],[196,1,196,4],[196,5,196,11],[196,12,196,17],[199,16,200,17],[202,18,202,21],[42,20,43,20],[42,21,43,23],[36,12,37,12],[36,13,37,13],[36,14,37,14],[36,15,37,16],[26,4,27,4],[30,12,31,12],[30,13,31,13],[30,14,31,14],[30,15,31,16]]}
["（様式1-4-７）農用地利用集積等促進計画）"]
[]
[null,null,null,null,null,null,null,null,null,null,null,null,null,null,null,null,null,null,null,null,null,null,"市町",null,"区域名"]
[null,null,null,"　　　農用地利用集積等促進計画",null,null,null,null,null,null,null,null,null,null,null,null,null,null,null,null,null,null,null,null,""]
[]
[null,null,"［機構に対する農地中間管理権の設定等］",null,null,null,null,null,null,null,null,null,null,null,null,null,"［機構による賃借権の設定等］",null,null,null,null,null,"賃料支払開始年月日"]
[]
[]
[null,"整理番号","農地中間管理権の設定等を行う者（貸付人:地権者等）\n（Ａ）",null,null,null,null,null,"ﾌﾘｶﾞﾅ",null,null,null,"同意印",null,null,"賃借権の設定等を受ける者\n（借受人：耕作者）\n（Ｂ）",null,null,null,null,null,null,"ﾌﾘｶﾞﾅ",null,null,null,null,null,"同意印"]
[null,null,null,"（住所）〒",null,null,null,null,null,null,null,null,null,null,null,null,null,null,"（住所）〒",null,null,null,""]
[null,null,null,"出し手住所",null,null,null,null,"（氏名又は名称）",null,null,null,null,null,null,null,null,null,null,null,null,null,"（氏名又は名称）"]
[]
[]
[null,null,"農地中間管理権の設定等を受ける者（借受人：公社）",null,null,null,null,null,"ﾌﾘｶﾞﾅ",null,null,null,"同意印",null,null,"賃借権の設定等を行う者\n（貸付人：公社）",null,null,null,null,null,null,"ﾌﾘｶﾞﾅ",null,null,null,null,null,"同意印"]
[null,null,null,"（住所）〒","420-0853",null,null,null,"ｼｽﾞｵｶｹﾝﾉｳｷﾞｮｳｼﾝｺｳｺｳｼｬﾘｼﾞﾁｮｳ",null,null,null,"理事長印",null,null,null,null,null,"（住所）〒",null,null,null,"同　　左",null,null,null,null,null,"理事長印"]
{"$rows_left_out":187}