{"text_format":"1","workbook":"xlsx","n_sheets":3,"sheets":["促進計画書（出し手用）A４","別紙","貸付意向申出書"],"not_rendered":{"charts":0,"images":0,"macros":1,"external_links":0,"defined_names":3,"comments":0,"pivot_tables":0},"unopened":[],"bounds":{"document_bytes":16777216,"sheet_cells":100000,"rows_first":2000,"rows_last":500,"rows_between":2000,"halvings":0,"cell_chars":16384,"cell_head_chars":4096},"cells_cut":0,"cells_raw":0,"read":"whole","date_system":"1900"}

{"sheet":"促進計画書（出し手用）A４","index":0,"n_rows":92,"n_cols":18,"rows_kept":92,"cut":false,"hidden":false,"merged":[[79,0,79,3],[81,0,81,17],[60,0,60,3],[61,0,61,17],[59,0,59,17],[56,0,56,3],[58,0,58,17],[57,0,57,17],[80,0,80,17],[69,0,69,3],[73,0,73,3],[64,0,64,3],[65,0,65,17],[63,0,63,17],[62,0,62,17],[78,0,78,17],[77,0,77,17],[76,0,76,17],[75,0,75,17],[74,0,74,17],[71,0,71,17],[72,0,72,17],[70,0,70,17],[68,0,68,17],[67,0,67,17],[66,0,66,17],[45,0,45,3],[48,0,48,17],[47,0,47,17],[46,0,46,17],[44,0,44,17],[55,0,55,17],[54,0,54,17],[49,0,49,3],[51,0,51,3],[53,0,53,3],[52,0,52,17],[50,0,50,17],[39,2,39,16],[40,2,40,16],[41,2,41,16],[31,2,31,16],[34,2,34,16],[35,2,35,16],[36,2,36,16],[37,2,37,16],[38,2,38,16],[16,2,18,2],[16,3,16,6],[16,7,16,9],[17,3,18,6],[17,7,18,9],[21,2,21,7],[21,8,21,15],[21,16,24,16],[22,2,22,5],[22,6,24,6],[22,7,23,7],[22,8,24,8],[22,9,24,9],[22,10,24,10],[22,11,24,11],[22,12,24,12],[22,13,22,14],[23,2,24,2],[23,3,24,3],[23,4,24,4],[23,5,24,5],[23,13,24,13],[5,12,6,12],[10,3,11,3],[10,4,11,6],[10,7,11,8],[10,9,10,11],[10,13,11,16],[11,9,11,11],[8,13,8,16],[13,7,14,8],[13,9,13,11],[14,9,14,11],[91,12,93,16],[91,8,93,11],[91,2,93,7],[94,12,96,16],[94,8,96,11],[94,2,96,7],[86,2,88,5],[86,6,88,9],[86,10,88,12],[86,13,88,16],[90,0,90,17],[83,13,85,16],[83,10,85,12],[83,6,85,9],[83,2,85,5],[5,2,9,2],[10,2,14,2],[20,2,20,3],[12,3,14,6],[12,7,12,8],[12,9,12,11],[12,12,14,12],[12,13,14,16],[5,13,6,16],[6,9,6,11],[7,3,9,6],[7,7,7,8],[7,9,7,11],[7,12,9,12],[8,7,9,8],[8,9,9,11],[10,12,11,12],[5,3,6,3],[5,4,6,6],[5,7,6,8]]}
["（様式例4）農用地利用集積等促進計画書(出し手→埼玉県農林公社)"]
[]
[null,null,null,null,null,null,null,"農　用　地　利　用　集　積　等　促　進　計　画　書　（記入例）",null,null,null,null,null,null,"捨印","捨印",null,4]
[null,null,null,null,null,null,null,null,null,null,null,null,null,null,"㊞","㊞"]
[]
[null,null,"農地中間管理権の設定を行う者（甲）","〒","350-0292",null,null,"電話番号",null,"ﾌﾘｶﾞﾅ",null,null,"同意印","生年月日"]
[null,null,null,null,null,null,null,null,null,"ｻｶﾄﾞ ﾀﾛｳ"]
[null,null,null,"坂戸市千代田１－１－１",null,null,null,"（昼間連絡がつく番号）",null,"（氏名又は名称）",null,null,"㊞"]
[null,null,null,null,null,null,null,"〇〇〇－〇〇〇－〇〇〇〇",null,"坂戸　太郎",null,null,null,"昭和〇〇年〇〇月〇〇日"]
[]
[null,null,"農地中間管理権の設定を受ける者（乙）","〒","361-0013",null,null,"電話番号",null,"ﾌﾘｶﾞﾅ",null,null,"同意印","生年月日"]
[null,null,null,null,null,null,null,null,null,"ｺｳｴｷｼｬﾀﾞﾝﾎｳｼﾞﾝｻｲﾀﾏｹﾝﾉｳﾘﾝｺｳｼｬ　ﾘｼﾞﾁｮｳ ｵﾊﾞﾀ ﾐｷ"]
[null,null,null,"埼玉県行田市大字真名板1975番1",null,null,null,"（昼間連絡がつく番号）",null,"（氏名又は名称）",null,null,"㊞"]
[null,null,null,null,null,null,null,"048-558-3555",null,"公益社団法人埼玉県農林公社"]
[null,null,null,null,null,null,null,null,null,"理事長   小畑　幹"]
[]
[null,null,"農地中間管理権の設定に係る地域計画（A)","地域計画の公告日等",null,null,null,"地域計画の区域名"]
[]
[]
[]
[null,null,"１．　各筆明細"]
[null,null,"農地中間管理権の設定を行う土地（B）",null,null,null,null,null,"（乙）に設定する権利（C）",null,null,null,null,null,null,null,"備　考"]
[null,null,"所　　　　在",null,null,null,"現況\n地目","面積","権　利\nの種類","内容\n(利用目的・\n作付作物等)","始期\n（年月日）","終期\n（年月日）","存続期間\n（年月）","借賃",null,"借賃の"]
[null,null,"市町村","大字 ","字","地　　番",null,null,null,null,null,null,null,"年額\n（円）","10aあたり","支払方法"]
[null,null,null,null,null,null,null,"（㎡）",null,null,null,null,null,null,"（円）","（支払期限）"]
[null,1,"別紙のとおり"]
[null,2]
[null,3]
[null,4]
[null,5]
[]
[null,null,"(D)設定する土地の（甲）以外の権限者等の有無　　　　　１．なし　　　　　２．あり（同意書等は別紙のとおり）"]
[]
[null,null,"（記載注意）"]
[null,null,"（１） この各筆明細は、権利の設定を行う者ごとに別葉とする。"]
[null,null,"（２）（Ｂ）欄の「面積」は登記記録の地積によるものとする。なお、１筆の一部について農地中間管理権が設定される場合には、面積に貸借する面積を記載の上、備考に「登記面積○○○㎡のうち○○○㎡」のように記載する。"]
[null,null,"（３）（C）欄の「権利の種類」は、「賃貸借」と「使用貸借」のいずれかを記載する。"]
[null,null,"（４）（C）欄の「内容」は、当該土地の利用目的（「水稲」「露地野菜」「施設野菜」「果樹」「花卉」等）を記載する。"]
[null,null,"（５）（C）欄の「存続期間」は、「○年」または「○年○か月」と記載する。"]
[null,null,"（６）（C）欄の「借賃」は、当該土地の１年分の総額と10ａあたりの単価額を記載する。10ａあたりの借賃が毎年の米価等により変動する場合、年額の欄に「支払時算出」、10ａあたりの欄に農協名、品種名、等級及び数量の概算"]
[null,null,"　　金（例：「JAほくさい 彩のかがやき一等米概算金30kg相当額」）として記載する。借賃が筆ごとに固定の場合は、10ａあたりの欄には「（固定借賃）」と記載する。また、使用貸借の場合、どちらの欄にも「０円」と記載する。"]
[null,null,"（７）（C）欄の「借賃の支払方法」は、「口座振込又は振替（12月末）」と記載する。"]
["２　共通事項"]
[]
["　農用地利用集積等促進計画（以下「本計画」という。）の定めるところにより、設定される農地中間管理権は１の各筆明細に定めるもののほか、次に定めるところによる。なお、以下、農地中間管理権を設定する者を「甲」（以下「甲」という。）とし、農地中間管理権の設定を受ける者（公益社団法人埼玉県農林公社）を「乙」（以下「乙」という。）とする。"]
["（１）転貸"]
["　乙は、農地中間管理権の目的物（以下「目的物」という。）を乙が定めた第三者（以下「転借人」という。）に転貸して使用及び収益させることができる。"]
["（２）面積による借賃の増減額請求"]
["　甲及び乙は、当該土地の１の各筆明細に記載された面積と実測面積との間に差異があっても、異議を述べず、また、借賃の増減を請求しない。ただし、国土調査による成果及び土地改良事業による換地等に伴う面積の増減に関してはこの限りでない。"]
["（３）借賃の変更"]
["　本計画を定めた後、借賃の変更に当たっては、農地法（昭和27年法律第229号）第52条の農業委員会が提供する借賃の動向や地域関係者による協議結果等を勘案して、甲、乙及び県または市町村が協議して定める額に変更することができる。ただし、経済状況の変化等により農地の借賃等が著しく不相当となったときは、当事者は借賃等の変更協議を申し出ることができる。"]
["（４）借賃の支払猶予"]
["　甲は、乙が災害その他やむを得ない事由のため、１の各筆明細に記載された借賃の支払期限までに借賃の支払をすることができない場合には、相当と認められる期日までその支払を猶予する。"]
["（５）借賃の減額"]
["ア　農地中間管理権の目的物が農地である場合で、目的物の転借人から乙に対して農地法第20条又は民法（明治29年法律第89号）609条の規定に基づく借賃の減額請求があり、乙が当該借賃を減額する場合には、乙は甲に\n　対して、借賃の減額を請求することができる。減額されるべき額は、甲、乙及び転借人が協議して定める。"]
["イ　目的物の一部が滅失その他の事由により使用及び収益をすることができなくなった場合で、乙又は転借人の責めに帰することができない事由によるときは、賃料はその使用及び収益をすることができなくなった部分の\n　割合に応じて減額され、目的物が使用及び収益をすることが可能となったときは減額前の賃料に戻る。なお、賃料の減額の時期及び減額前の賃料に戻る時期並びに減額の割合については、作物の作付・収穫の状況を踏ま\n　えて甲及び乙が協議して定める。"]
["（６）修繕及び改良 "]
["ア　甲は乙及び転借人の責に帰すべき事由によらないで生じた目的物の損耗については、自らの費用と責任において当該目的物を修繕する。ただし緊急を要するとき、又は甲において修繕することができない場合で乙が甲\n　の同意を得たときは、乙が修繕し又は転借人に修繕させることができる。この場合において、乙又は転借人が修繕の費用を支出したときは、甲に対してその費用を請求することができる。"]
["イ　乙は、農地法第４条第１項又は第５条第１項の規定に基づく許可を要する改良や農業委員会への届出を要する改良及び抜根を伴う農地改良を行う場合には、あらかじめ甲の同意を得るものとする。また、転借人が同行\n　為を行う場合には、乙及び乙を経由して甲の同意を得るものとする。"]
["ウ　修繕費又は改良費の負担及び償還は、別表１に定めたものを除き、民法、土地改良法(昭和24年法律第195号)に従い、原則、甲の負担とする。"]
{"$rows_left_out":33}
{"sheet":"別紙","index":1,"n_rows":25,"n_cols":16,"rows_kept":25,"cut":false,"hidden":false,"merged":[[3,4,4,4],[3,12,4,12],[0,1,0,2],[1,1,1,6],[1,7,1,14],[1,15,4,15],[2,1,2,4],[2,5,4,5],[2,6,3,6],[2,7,4,7],[2,8,4,8],[2,9,4,9],[2,10,4,10],[2,11,4,11],[2,12,2,13],[3,1,4,1],[3,2,4,2],[3,3,4,3]]}
[null,"別紙（記入例）"]
[null,"農地中間管理権の設定を行う土地（B）",null,null,null,null,null,"（乙）に設定する権利（C）",null,null,null,null,null,null,null,"備　考"]
[null,"所　　　　在",null,null,null,"現況\n地目","面積","権　利\nの種類","内容\n(利用目的・\n作付作物等)","始期\n（年月日）","終期\n（年月日）","存続期間\n（年月）","借賃",null,"借賃の"]
[null,"市町村","大字 ","字","地　　番",null,null,null,null,null,null,null,"年額\n（円）","10aあたり","支払方法"]
[null,null,null,null,null,null,"（㎡）",null,null,null,null,null,null,"（円）","（支払期限）"]
[1,"坂戸市","〇〇","〇〇","〇〇－〇","田","〇〇〇","使用貸借","水田利用","令和7年6月1日","令和〇年5月31日","〇年","0円","0円"]
[2,"坂戸市","〇〇","〇〇","〇〇－〇","畑","〇〇〇","賃貸借","普通畑利用","令和7年6月1日","令和〇年5月31日","〇年","〇〇円","〇〇円","口座\n（12月末日）"]
[3,"坂戸市","〇〇","〇〇","〇〇－〇","田","〇〇〇","賃貸借","水田利用","令和7年6月1日","令和〇年5月31日","〇年","〇〇円","〇〇円","口座\n（12月末日）"]
[4,{"$f":"IF(C9=\"\",\"\",\"坂戸市\")","v":""},{"$f":"IFERROR(VLOOKUP('促進計画書（出し手用）A４'!#REF!&\"-\"&A9,#REF!,2,FALSE),\"\")","v":""},{"$f":"IFERROR(VLOOKUP('促進計画書（出し手用）A４'!#REF!&\"-\"&A9,#REF!,3,FALSE),\"\")","v":""},{"$f":"IFERROR(VLOOKUP('促進計画書（出し手用）A４'!#REF!&\"-\"&A9,#REF!,6,FALSE),\"\")","v":""},{"$f":"IFERROR(VLOOKUP('促進計画書（出し手用）A４'!#REF!&\"-\"&A9,#REF!,8,FALSE),\"\")","v":""},{"$f":"IFERROR(VLOOKUP('促進計画書（出し手用）A４'!#REF!&\"-\"&A9,#REF!,9,FALSE),\"\")","v":""},null,{"$f":"IF(F9=\"田\",\"水田利用\",IF(F9=\"畑\",\"普通畑利用\",\"\"))","v":""},{"$f":"IF(I9=\"\",\"\",\"令和7年6月1日\")","v":""}]
[5,"",{"$f":"IFERROR(VLOOKUP('促進計画書（出し手用）A４'!#REF!&\"-\"&A10,#REF!,2,FALSE),\"\")","v":""},{"$f":"IFERROR(VLOOKUP('促進計画書（出し手用）A４'!#REF!&\"-\"&A10,#REF!,3,FALSE),\"\")","v":""},{"$f":"IFERROR(VLOOKUP('促進計画書（出し手用）A４'!#REF!&\"-\"&A10,#REF!,6,FALSE),\"\")","v":""},{"$f":"IFERROR(VLOOKUP('促進計画書（出し手用）A４'!#REF!&\"-\"&A10,#REF!,8,FALSE),\"\")","v":""},{"$f":"IFERROR(VLOOKUP('促進計画書（出し手用）A４'!#REF!&\"-\"&A10,#REF!,9,FALSE),\"\")","v":""},null,"",""]
[6,"",{"$f":"IFERROR(VLOOKUP('促進計画書（出し手用）A４'!#REF!&\"-\"&A11,#REF!,2,FALSE),\"\")","v":""},{"$f":"IFERROR(VLOOKUP('促進計画書（出し手用）A４'!#REF!&\"-\"&A11,#REF!,3,FALSE),\"\")","v":""},{"$f":"IFERROR(VLOOKUP('促進計画書（出し手用）A４'!#REF!&\"-\"&A11,#REF!,6,FALSE),\"\")","v":""},{"$f":"IFERROR(VLOOKUP('促進計画書（出し手用）A４'!#REF!&\"-\"&A11,#REF!,8,FALSE),\"\")","v":""},{"$f":"IFERROR(VLOOKUP('促進計画書（出し手用）A４'!#REF!&\"-\"&A11,#REF!,9,FALSE),\"\")","v":""},null,"",""]
[7,"",{"$f":"IFERROR(VLOOKUP('促進計画書（出し手用）A４'!#REF!&\"-\"&A12,#REF!,2,FALSE),\"\")","v":""},{"$f":"IFERROR(VLOOKUP('促進計画書（出し手用）A４'!#REF!&\"-\"&A12,#REF!,3,FALSE),\"\")","v":""},{"$f":"IFERROR(VLOOKUP('促進計画書（出し手用）A４'!#REF!&\"-\"&A12,#REF!,6,FALSE),\"\")","v":""},{"$f":"IFERROR(VLOOKUP('促進計画書（出し手用）A４'!#REF!&\"-\"&A12,#REF!,8,FALSE),\"\")","v":""},{"$f":"IFERROR(VLOOKUP('促進計画書（出し手用）A４'!#REF!&\"-\"&A12,#REF!,9,FALSE),\"\")","v":""},null,"",""]
[8,"",{"$f":"IFERROR(VLOOKUP('促進計画書（出し手用）A４'!#REF!&\"-\"&A13,#REF!,2,FALSE),\"\")","v":""},{"$f":"IFERROR(VLOOKUP('促進計画書（出し手用）A４'!#REF!&\"-\"&A13,#REF!,3,FALSE),\"\")","v":""},{"$f":"IFERROR(VLOOKUP('促進計画書（出し手用）A４'!#REF!&\"-\"&A13,#REF!,6,FALSE),\"\")","v":""},{"$f":"IFERROR(VLOOKUP('促進計画書（出し手用）A４'!#REF!&\"-\"&A13,#REF!,8,FALSE),\"\")","v":""},{"$f":"IFERROR(VLOOKUP('促進計画書（出し手用）A４'!#REF!&\"-\"&A13,#REF!,9,FALSE),\"\")","v":""},null,"",""]
[9,"",{"$f":"IFERROR(VLOOKUP('促進計画書（出し手用）A４'!#REF!&\"-\"&A14,#REF!,2,FALSE),\"\")","v":""},{"$f":"IFERROR(VLOOKUP('促進計画書（出し手用）A４'!#REF!&\"-\"&A14,#REF!,3,FALSE),\"\")","v":""},{"$f":"IFERROR(VLOOKUP('促進計画書（出し手用）A４'!#REF!&\"-\"&A14,#REF!,6,FALSE),\"\")","v":""},{"$f":"IFERROR(VLOOKUP('促進計画書（出し手用）A４'!#REF!&\"-\"&A14,#REF!,8,FALSE),\"\")","v":""},{"$f":"IFERROR(VLOOKUP('促進計画書（出し手用）A４'!#REF!&\"-\"&A14,#REF!,9,FALSE),\"\")","v":""},null,"",""]
[10,"",{"$f":"IFERROR(VLOOKUP('促進計画書（出し手用）A４'!#REF!&\"-\"&A15,#REF!,2,FALSE),\"\")","v":""},{"$f":"IFERROR(VLOOKUP('促進計画書（出し手用）A４'!#REF!&\"-\"&A15,#REF!,3,FALSE),\"\")","v":""},{"$f":"IFERROR(VLOOKUP('促進計画書（出し手用）A４'!#REF!&\"-\"&A15,#REF!,6,FALSE),\"\")","v":""},{"$f":"IFERROR(VLOOKUP('促進計画書（出し手用）A４'!#REF!&\"-\"&A15,#REF!,8,FALSE),\"\")","v":""},{"$f":"IFERROR(VLOOKUP('促進計画書（出し手用）A４'!#REF!&\"-\"&A15,#REF!,9,FALSE),\"\")","v":""},null,"",""]
[11,"",{"$f":"IFERROR(VLOOKUP('促進計画書（出し手用）A４'!#REF!&\"-\"&A16,#REF!,2,FALSE),\"\")","v":""},{"$f":"IFERROR(VLOOKUP('促進計画書（出し手用）A４'!#REF!&\"-\"&A16,#REF!,3,FALSE),\"\")","v":""},{"$f":"IFERROR(VLOOKUP('促進計画書（出し手用）A４'!#REF!&\"-\"&A16,#REF!,6,FALSE),\"\")","v":""},{"$f":"IFERROR(VLOOKUP('促進計画書（出し手用）A４'!#REF!&\"-\"&A16,#REF!,8,FALSE),\"\")","v":""},{"$f":"IFERROR(VLOOKUP('促進計画書（出し手用）A４'!#REF!&\"-\"&A16,#REF!,9,FALSE),\"\")","v":""},null,"",""]
[12,"",{"$f":"IFERROR(VLOOKUP('促進計画書（出し手用）A４'!#REF!&\"-\"&A17,#REF!,2,FALSE),\"\")","v":""},{"$f":"IFERROR(VLOOKUP('促進計画書（出し手用）A４'!#REF!&\"-\"&A17,#REF!,3,FALSE),\"\")","v":""},{"$f":"IFERROR(VLOOKUP('促進計画書（出し手用）A４'!#REF!&\"-\"&A17,#REF!,6,FALSE),\"\")","v":""},{"$f":"IFERROR(VLOOKUP('促進計画書（出し手用）A４'!#REF!&\"-\"&A17,#REF!,8,FALSE),\"\")","v":""},{"$f":"IFERROR(VLOOKUP('促進計画書（出し手用）A４'!#REF!&\"-\"&A17,#REF!,9,FALSE),\"\")","v":""},null,"",""]
[13,"",{"$f":"IFERROR(VLOOKUP('促進計画書（出し手用）A４'!#REF!&\"-\"&A18,#REF!,2,FALSE),\"\")","v":""},{"$f":"IFERROR(VLOOKUP('促進計画書（出し手用）A４'!#REF!&\"-\"&A18,#REF!,3,FALSE),\"\")","v":""},{"$f":"IFERROR(VLOOKUP('促進計画書（出し手用）A４'!#REF!&\"-\"&A18,#REF!,6,FALSE),\"\")","v":""},{"$f":"IFERROR(VLOOKUP('促進計画書（出し手用）A４'!#REF!&\"-\"&A18,#REF!,8,FALSE),\"\")","v":""},{"$f":"IFERROR(VLOOKUP('促進計画書（出し手用）A４'!#REF!&\"-\"&A18,#REF!,9,FALSE),\"\")","v":""},null,"",""]
[14,"",{"$f":"IFERROR(VLOOKUP('促進計画書（出し手用）A４'!#REF!&\"-\"&A19,#REF!,2,FALSE),\"\")","v":""},{"$f":"IFERROR(VLOOKUP('促進計画書（出し手用）A４'!#REF!&\"-\"&A19,#REF!,3,FALSE),\"\")","v":""},{"$f":"IFERROR(VLOOKUP('促進計画書（出し手用）A４'!#REF!&\"-\"&A19,#REF!,6,FALSE),\"\")","v":""},{"$f":"IFERROR(VLOOKUP('促進計画書（出し手用）A４'!#REF!&\"-\"&A19,#REF!,8,FALSE),\"\")","v":""},{"$f":"IFERROR(VLOOKUP('促進計画書（出し手用）A４'!#REF!&\"-\"&A19,#REF!,9,FALSE),\"\")","v":""},null,"",""]
[15,"",{"$f":"IFERROR(VLOOKUP('促進計画書（出し手用）A４'!#REF!&\"-\"&A20,#REF!,2,FALSE),\"\")","v":""},{"$f":"IFERROR(VLOOKUP('促進計画書（出し手用）A４'!#REF!&\"-\"&A20,#REF!,3,FALSE),\"\")","v":""},{"$f":"IFERROR(VLOOKUP('促進計画書（出し手用）A４'!#REF!&\"-\"&A20,#REF!,6,FALSE),\"\")","v":""},{"$f":"IFERROR(VLOOKUP('促進計画書（出し手用）A４'!#REF!&\"-\"&A20,#REF!,8,FALSE),\"\")","v":""},{"$f":"IFERROR(VLOOKUP('促進計画書（出し手用）A４'!#REF!&\"-\"&A20,#REF!,9,FALSE),\"\")","v":""},null,"",""]
[16,"",{"$f":"IFERROR(VLOOKUP('促進計画書（出し手用）A４'!#REF!&\"-\"&A21,#REF!,2,FALSE),\"\")","v":""},{"$f":"IFERROR(VLOOKUP('促進計画書（出し手用）A４'!#REF!&\"-\"&A21,#REF!,3,FALSE),\"\")","v":""},{"$f":"IFERROR(VLOOKUP('促進計画書（出し手用）A４'!#REF!&\"-\"&A21,#REF!,6,FALSE),\"\")","v":""},{"$f":"IFERROR(VLOOKUP('促進計画書（出し手用）A４'!#REF!&\"-\"&A21,#REF!,8,FALSE),\"\")","v":""},{"$f":"IFERROR(VLOOKUP('促進計画書（出し手用）A４'!#REF!&\"-\"&A21,#REF!,9,FALSE),\"\")","v":""},null,"",""]
[17,"",{"$f":"IFERROR(VLOOKUP('促進計画書（出し手用）A４'!#REF!&\"-\"&A22,#REF!,2,FALSE),\"\")","v":""},{"$f":"IFERROR(VLOOKUP('促進計画書（出し手用）A４'!#REF!&\"-\"&A22,#REF!,3,FALSE),\"\")","v":""},{"$f":"IFERROR(VLOOKUP('促進計画書（出し手用）A４'!#REF!&\"-\"&A22,#REF!,6,FALSE),\"\")","v":""},{"$f":"IFERROR(VLOOKUP('促進計画書（出し手用）A４'!#REF!&\"-\"&A22,#REF!,8,FALSE),\"\")","v":""},{"$f":"IFERROR(VLOOKUP('促進計画書（出し手用）A４'!#REF!&\"-\"&A22,#REF!,9,FALSE),\"\")","v":""},null,"",""]
[18,"",{"$f":"IFERROR(VLOOKUP('促進計画書（出し手用）A４'!#REF!&\"-\"&A23,#REF!,2,FALSE),\"\")","v":""},{"$f":"IFERROR(VLOOKUP('促進計画書（出し手用）A４'!#REF!&\"-\"&A23,#REF!,3,FALSE),\"\")","v":""},{"$f":"IFERROR(VLOOKUP('促進計画書（出し手用）A４'!#REF!&\"-\"&A23,#REF!,6,FALSE),\"\")","v":""},{"$f":"IFERROR(VLOOKUP('促進計画書（出し手用）A４'!#REF!&\"-\"&A23,#REF!,8,FALSE),\"\")","v":""},{"$f":"IFERROR(VLOOKUP('促進計画書（出し手用）A４'!#REF!&\"-\"&A23,#REF!,9,FALSE),\"\")","v":""},null,"",""]
[19,"",{"$f":"IFERROR(VLOOKUP('促進計画書（出し手用）A４'!#REF!&\"-\"&A24,#REF!,2,FALSE),\"\")","v":""},{"$f":"IFERROR(VLOOKUP('促進計画書（出し手用）A４'!#REF!&\"-\"&A24,#REF!,3,FALSE),\"\")","v":""},{"$f":"IFERROR(VLOOKUP('促進計画書（出し手用）A４'!#REF!&\"-\"&A24,#REF!,6,FALSE),\"\")","v":""},{"$f":"IFERROR(VLOOKUP('促進計画書（出し手用）A４'!#REF!&\"-\"&A24,#REF!,8,FALSE),\"\")","v":""},{"$f":"IFERROR(VLOOKUP('促進計画書（出し手用）A４'!#REF!&\"-\"&A24,#REF!,9,FALSE),\"\")","v":""},null,"",""]
[20,"",{"$f":"IFERROR(VLOOKUP('促進計画書（出し手用）A４'!#REF!&\"-\"&A25,#REF!,2,FALSE),\"\")","v":""},{"$f":"IFERROR(VLOOKUP('促進計画書（出し手用）A４'!#REF!&\"-\"&A25,#REF!,3,FALSE),\"\")","v":""},{"$f":"IFERROR(VLOOKUP('促進計画書（出し手用）A４'!#REF!&\"-\"&A25,#REF!,6,FALSE),\"\")","v":""},{"$f":"IFERROR(VLOOKUP('促進計画書（出し手用）A４'!#REF!&\"-\"&A25,#REF!,8,FALSE),\"\")","v":""},{"$f":"IFERROR(VLOOKUP('促進計画書（出し手用）A４'!#REF!&\"-\"&A25,#REF!,9,FALSE),\"\")","v":""},null,"",""]

{"sheet":"貸付意向申出書","index":2,"n_rows":87,"n_cols":35,"rows_kept":87,"cut":false,"hidden":false,"merged":[[13,17,13,21],[13,22,13,35],[0,1,0,35],[4,14,4,22],[10,17,10,21],[10,22,10,35],[1,34,1,35],[5,25,5,35],[11,17,11,21],[11,22,11,35],[12,17,12,21],[12,22,12,35],[15,1,15,35],[17,1,17,4],[17,5,17,8],[17,9,17,11],[17,12,17,13],[17,14,17,17],[17,18,17,20],[17,21,17,24],[17,25,17,27],[18,1,18,4],[18,5,18,8],[18,9,18,11],[18,12,18,13],[18,14,18,17],[18,18,18,20],[19,12,19,13],[19,9,19,11],[18,28,18,31],[19,5,19,8],[19,1,19,4],[19,18,19,20],[19,14,19,17],[18,32,18,35],[17,28,17,31],[17,32,17,35],[18,21,18,24],[18,25,18,27],[20,21,20,24],[20,25,20,27],[20,28,20,31],[20,32,20,35],[19,25,19,27],[19,21,19,24],[21,25,21,27],[21,28,21,31],[19,28,19,31],[19,32,19,35],[20,1,20,4],[20,5,20,8],[20,9,20,11],[20,12,20,13],[20,14,20,17],[20,18,20,20],[23,12,23,13],[23,14,23,17],[23,18,23,20],[23,21,23,24],[23,25,23,27],[23,28,23,31],[21,32,21,35],[22,1,22,4],[22,5,22,8],[22,9,22,11],[22,12,22,13],[22,14,22,17],[22,18,22,20],[22,21,22,24],[22,25,22,27],[22,28,22,31],[22,32,22,35],[21,1,21,4],[21,5,21,8],[21,9,21,11],[21,12,21,13],[21,14,21,17],[21,18,21,20],[21,21,21,24],[25,1,25,4],[25,25,25,27],[25,28,25,31],[23,32,23,35],[24,1,24,4],[24,5,24,8],[24,9,24,11],[24,12,24,13],[24,14,24,17],[24,18,24,20],[24,21,24,24],[25,5,25,8],[25,9,25,11],[25,12,25,13],[25,14,25,17],[25,18,25,20],[25,21,25,24],[25,32,25,35],[24,25,24,27],[24,28,24,31],[24,32,24,35],[23,1,23,4],[23,5,23,8],[23,9,23,11],[27,28,27,31],[27,32,27,35],[31,1,31,35],[28,1,29,35],[30,1,30,35],[26,28,26,31],[26,32,26,35],[27,1,27,4],[27,5,27,8],[27,9,27,11],[27,12,27,13],[27,14,27,17],[27,18,27,20],[27,21,27,24],[27,25,27,27],[26,1,26,4],[26,5,26,8],[26,9,26,11],[26,12,26,13],[26,14,26,17],[26,18,26,20],[26,21,26,24],[26,25,26,27],[35,1,35,18],[35,19,35,35],[32,1,32,9],[32,10,32,18],[32,19,32,26],[32,27,32,35],[33,1,33,9],[33,10,33,18],[33,19,33,26],[33,27,33,35],[34,1,34,9],[34,10,34,18],[34,19,34,26],[34,27,34,35],[47,1,47,35],[42,1,42,26],[43,1,43,26],[44,1,44,26],[40,27,40,35],[41,27,41,35],[42,27,42,35],[43,27,43,35],[44,27,44,35],[40,1,40,26],[41,1,41,26],[86,1,86,35],[87,1,87,35],[51,1,51,35],[52,1,52,35],[37,1,37,35],[38,1,38,26],[38,27,38,35],[39,1,39,26],[39,27,39,35],[46,1,46,35],[65,1,65,35],[66,1,66,35],[67,1,67,35],[83,1,83,35],[84,1,84,35],[85,1,85,35],[71,1,71,35],[72,1,72,35],[73,1,73,35],[74,1,74,35],[75,1,75,35],[76,1,76,35],[53,1,53,35],[54,1,54,35],[55,1,55,35],[56,1,56,35],[57,1,57,35],[58,1,58,35],[92,1,92,35],[68,1,68,35],[69,1,69,35],[70,1,70,35],[59,1,59,35],[60,1,60,35],[61,1,61,35],[62,1,62,35],[63,1,63,35],[64,1,64,35],[89,1,89,35],[90,1,90,35],[91,1,91,35],[88,1,88,35],[77,1,77,35],[78,1,78,35],[79,1,79,35],[80,1,80,35],[81,1,81,35],[82,1,82,35]]}
[null,"様式例１（農地中間管理事業法第８条第３項関係）"]
[null,null,null,null,null,null,null,null,null,null,null,null,null,null,null,null,null,null,null,null,null,null,null,null,null,null,null,null,null,null,null,null,null,null,4]
[]
[]
[null,null,null,null,null,null,null,null,null,null,null,null,null,null,"貸付意向申出書",null,null,null,null,null,null,null,null,"（記入例）"]
[null,null,null,null,null,null,null,null,null,null,null,null,null,null,null,null,null,null,null,null,null,null,null,null,null,"令和　〇年　〇〇月　〇〇日　"]
[]
[]
[null,null,null,"坂戸市長　様"]
[]
[null,null,null,null,null,null,null,null,null,null,null,null,null,null,null,null,null,"（住　　所）",null,null,null,null,"坂戸市千代田１－１－１"]
[null,null,null,null,null,null,null,null,null,null,null,null,null,null,null,null,null,"（氏　　名）",null,null,null,null,"坂戸　太郎"]
[null,null,null,null,null,null,null,null,null,null,null,null,null,null,null,null,null,"（年　　齢）",null,null,null,null,"　　　　　〇〇　　歳"]
[null,null,null,null,null,null,null,null,null,null,null,null,null,null,null,null,null,"（電話番号）",null,null,null,null,"〇〇〇－〇〇〇－〇〇〇〇"]
[]
[null,"１　農地中間管理機構が実施する農地中間管理事業で、以下の農地を貸付けたいので申し出ます。"]
[null,"【農地の所在等】"]
[null,"大字",null,null,null,"字",null,null,null,"地番",null,null,"現況\n地目",null,"面積\n(㎡)",null,null,null,"栽培\n作物",null,null,"貸付期間",null,null,null,"賃貸\n(円/10a)",null,null,"現在の\n耕作者",null,null,null,"備考\n(特記事項)"]
[1,"〇〇",null,null,null,"〇〇",null,null,null,"〇〇－〇",null,null,"田",null,"〇〇〇",null,null,null,"〇〇〇",null,null,"〇年",null,null,null,"0円",null,null,"〇〇　〇〇"]
[2,"〇〇",null,null,null,"〇〇",null,null,null,"〇〇－〇",null,null,"畑",null,"〇〇〇",null,null,null,"〇〇〇",null,null,"〇年",null,null,null,"〇円",null,null,"〇〇　〇〇"]
[3,"〇〇",null,null,null,"〇〇",null,null,null,"〇〇－〇",null,null,"田",null,"〇〇〇",null,null,null,"〇〇〇",null,null,"〇年",null,null,null,"〇円",null,null,"〇〇　〇〇"]
[4,{"$f":"IFERROR(VLOOKUP(#REF!&\"-\"&A22,#REF!,2,FALSE),\"\")","v":""},null,null,null,{"$f":"IFERROR(VLOOKUP(#REF!&\"-\"&A22,#REF!,3,FALSE),\"\")","v":""},null,null,null,{"$f":"IFERROR(VLOOKUP(#REF!&\"-\"&A22,#REF!,6,FALSE),\"\")","v":""},null,null,{"$f":"IFERROR(VLOOKUP(#REF!&\"-\"&A22,#REF!,8,FALSE),\"\")","v":""},null,{"$f":"IFERROR(VLOOKUP(#REF!&\"-\"&A22,#REF!,9,FALSE),\"\")","v":""},null,null,null,null,null,null,null,null,null,null,null,null,null,{"$f":"IFERROR(VLOOKUP(#REF!&\"-\"&A22,#REF!,24,FALSE),\"\")","v":""}]
[5,{"$f":"IFERROR(VLOOKUP(#REF!&\"-\"&A23,#REF!,2,FALSE),\"\")","v":""},null,null,null,{"$f":"IFERROR(VLOOKUP(#REF!&\"-\"&A23,#REF!,3,FALSE),\"\")","v":""},null,null,null,{"$f":"IFERROR(VLOOKUP(#REF!&\"-\"&A23,#REF!,6,FALSE),\"\")","v":""},null,null,{"$f":"IFERROR(VLOOKUP(#REF!&\"-\"&A23,#REF!,8,FALSE),\"\")","v":""},null,{"$f":"IFERROR(VLOOKUP(#REF!&\"-\"&A23,#REF!,9,FALSE),\"\")","v":""},null,null,null,null,null,null,null,null,null,null,null,null,null,{"$f":"IFERROR(VLOOKUP(#REF!&\"-\"&A23,#REF!,24,FALSE),\"\")","v":""}]
[6,{"$f":"IFERROR(VLOOKUP(#REF!&\"-\"&A24,#REF!,2,FALSE),\"\")","v":""},null,null,null,{"$f":"IFERROR(VLOOKUP(#REF!&\"-\"&A24,#REF!,3,FALSE),\"\")","v":""},null,null,null,{"$f":"IFERROR(VLOOKUP(#REF!&\"-\"&A24,#REF!,6,FALSE),\"\")","v":""},null,null,{"$f":"IFERROR(VLOOKUP(#REF!&\"-\"&A24,#REF!,8,FALSE),\"\")","v":""},null,{"$f":"IFERROR(VLOOKUP(#REF!&\"-\"&A24,#REF!,9,FALSE),\"\")","v":""},null,null,null,null,null,null,null,null,null,null,null,null,null,{"$f":"IFERROR(VLOOKUP(#REF!&\"-\"&A24,#REF!,24,FALSE),\"\")","v":""}]
[7,{"$f":"IFERROR(VLOOKUP(#REF!&\"-\"&A25,#REF!,2,FALSE),\"\")","v":""},null,null,null,{"$f":"IFERROR(VLOOKUP(#REF!&\"-\"&A25,#REF!,3,FALSE),\"\")","v":""},null,null,null,{"$f":"IFERROR(VLOOKUP(#REF!&\"-\"&A25,#REF!,6,FALSE),\"\")","v":""},null,null,{"$f":"IFERROR(VLOOKUP(#REF!&\"-\"&A25,#REF!,8,FALSE),\"\")","v":""},null,{"$f":"IFERROR(VLOOKUP(#REF!&\"-\"&A25,#REF!,9,FALSE),\"\")","v":""},null,null,null,null,null,null,null,null,null,null,null,null,null,{"$f":"IFERROR(VLOOKUP(#REF!&\"-\"&A25,#REF!,24,FALSE),\"\")","v":""}]
[8,{"$f":"IFERROR(VLOOKUP(#REF!&\"-\"&A26,#REF!,2,FALSE),\"\")","v":""},null,null,null,{"$f":"IFERROR(VLOOKUP(#REF!&\"-\"&A26,#REF!,3,FALSE),\"\")","v":""},null,null,null,{"$f":"IFERROR(VLOOKUP(#REF!&\"-\"&A26,#REF!,6,FALSE),\"\")","v":""},null,null,{"$f":"IFERROR(VLOOKUP(#REF!&\"-\"&A26,#REF!,8,FALSE),\"\")","v":""},null,{"$f":"IFERROR(VLOOKUP(#REF!&\"-\"&A26,#REF!,9,FALSE),\"\")","v":""},null,null,null,null,null,null,null,null,null,null,null,null,null,{"$f":"IFERROR(VLOOKUP(#REF!&\"-\"&A26,#REF!,24,FALSE),\"\")","v":""}]
[9,{"$f":"IFERROR(VLOOKUP(#REF!&\"-\"&A27,#REF!,2,FALSE),\"\")","v":""},null,null,null,{"$f":"IFERROR(VLOOKUP(#REF!&\"-\"&A27,#REF!,3,FALSE),\"\")","v":""},null,null,null,{"$f":"IFERROR(VLOOKUP(#REF!&\"-\"&A27,#REF!,6,FALSE),\"\")","v":""},null,null,{"$f":"IFERROR(VLOOKUP(#REF!&\"-\"&A27,#REF!,8,FALSE),\"\")","v":""},null,{"$f":"IFERROR(VLOOKUP(#REF!&\"-\"&A27,#REF!,9,FALSE),\"\")","v":""},null,null,null,null,null,null,null,null,null,null,null,null,null,{"$f":"IFERROR(VLOOKUP(#REF!&\"-\"&A27,#REF!,24,FALSE),\"\")","v":""}]
[10,{"$f":"IFERROR(VLOOKUP(#REF!&\"-\"&A28,#REF!,2,FALSE),\"\")","v":""},null,null,null,{"$f":"IFERROR(VLOOKUP(#REF!&\"-\"&A28,#REF!,3,FALSE),\"\")","v":""},null,null,null,{"$f":"IFERROR(VLOOKUP(#REF!&\"-\"&A28,#REF!,6,FALSE),\"\")","v":""},null,null,{"$f":"IFERROR(VLOOKUP(#REF!&\"-\"&A28,#REF!,8,FALSE),\"\")","v":""},null,{"$f":"IFERROR(VLOOKUP(#REF!&\"-\"&A28,#REF!,9,FALSE),\"\")","v":""},null,null,null,null,null,null,null,null,null,null,null,null,null,{"$f":"IFERROR(VLOOKUP(#REF!&\"-\"&A28,#REF!,24,FALSE),\"\")","v":""}]
[null,"※「現在の耕作者」欄には、申出者が耕作している場合は、自作、申出者以外が耕作している場合には、その耕作者   の氏名を記入してください。"]
[]
[null,"※「備考（特記事項）」欄には、耕作するに当たって支障がある事項（水はけ、土質、形状、進入路、権利関係など）や農地の特徴について記入してください。"]
[null,"２　なお、農用地等の利用方法について以下の利用方法で使用する場合は、制約を付けたいので申し出ます。"]
[null,"項　目",null,null,null,null,null,null,null,null,"制約のある場合は○",null,null,null,null,null,null,null,null,"項　目",null,null,null,null,null,null,null,"制約のある場合は○"]
[null,"永年性作物",null,null,null,null,null,null,null,null,null,null,null,null,null,null,null,null,null,"ビニールハウス"]
[null,"植木",null,null,null,null,null,null,null,null,null,null,null,null,null,null,null,null,null,"農業用施設"]
[null,"その他制約を付ける項目（具体的に記載）"]
[null,"※制約をつけたい（利用してほしくない）項目の欄に○印を記入"]
[null,"３　農業経営の意向について"]
[null,"選択肢",null,null,null,null,null,null,null,null,null,null,null,null,null,null,null,null,null,null,null,null,null,null,null,null,null,"あてはまるものに○"]
[null,"農地中間管理事業に参加"]
[null,"農地中間管理事業に参加して耕作する"]
[null,"離農する"]
[null,"農地を相続したが農業は行わない"]
[null,"農業部門を減少（転換）する"]
[null,"その他（具体的に記入：　　　　　　　　）"]
[null,"※事業に参加して耕作する場合、農地中間管理事業借受希望申込書の提出が必要"]
[null,"（裏面あり）"]
[null,"様式例１（農地中間管理事業法第８条第３項関係）"]
[]
[]
[]
[null,"４　私は、機構関連事業について、以下の事項について説明を受け、承諾しています。"]
[null,"（１）機構関連事業（土地改良法（昭和２４年法律第１９５号）第８７条の３第１項の土地改良事業を"]
[null,"　　いう。）は、農地中間管理機構が借り入れている農用地等を対象に、農用地等の所有者や貸付けの"]
[null,"　　相手方の申請によらず、埼玉県が事業実施主体となって、農業者の費用負担や同意を求めずに農地"]
[null,"　　区画整備（これに付随する農道、農業用排水路、暗渠等の整備を含む。）、農業用用排水施設、農"]
[null,"　　道及び暗渠等の整備を行う基盤整備事業です。機構に貸し付けた農用地等については、機構関連事"]
[null,"　　業が行われることがあります。"]
[null,"（２）機構関連事業の対象となる農用地等は、埼玉県農地中間管理機構の借受期間が機構関連事業の計"]
[null,"　　画の決定（公告）時から１５年以上あるものです。"]
{"$rows_left_out":27}